Target
Small conductance calcium-activated potassium channel protein 1/2/3
Ligand
BDBM50048403
Substrate
Meas. Tech.
ChEMBL_197573 (CHEMBL873116)
IC50
1000±n/a nM
Citation
 Galanakis, DDavis, CAGanellin, CRDunn, PM Synthesis and quantitative structure-activity relationship of a novel series of small conductance Ca(2+)-activated K+ channel blockers related to dequalinium. J Med Chem 39:359-70 (1996)  
Target
Name:
Small conductance calcium-activated potassium channel protein 1/2/3
Synonyms:
Small conductance calcium-activated potassium channel
Type:
Mol. Mass.:
Description:
ASSAY_ID of ChEMBL is 1559987
Components:
This complex has 3 components.
Component 1
Name:
Small conductance calcium-activated potassium channel protein 3
Synonyms:
KCNN3_RAT SK3 | Small conductance calcium-activated potassium channel
Type:
PROTEIN
Mol. Mass.:
81476.29
Organism:
Rattus norvegicus
Description:
ChEMBL_494975
Residue:
732
  
Component 2
Name:
Small conductance calcium-activated potassium channel protein 1
Synonyms:
KCNN1_RAT Potassium Channel, Ca2+ Act., VS Small conductance calcium-activated potassium channel
Type:
Enzyme Catalytic Domain
Mol. Mass.:
59231.59
Organism:
RAT
Description:
Potassium Channel, Ca2+ Act., VS 0 RAT::P70606
Residue:
536
  
Component 3
Name:
Small conductance calcium-activated potassium channel protein 2
Synonyms:
KCNN2_RAT Small conductance calcium-activated potassium channel Small conductance calcium-activated potassium channel protein 2 (KCa2.2)
Type:
Protein
Mol. Mass.:
63876.72
Organism:
Rattus norvegicus (Rat)
Description:
P70604
Residue:
580
  
Inhibitor
Name:
BDBM50048403
Synonyms:
1,1'-(Deca-4,6-diyne-1,10-diyl)bis(4-amino-2-methylquinolinium) Diiodide Hydrate 1-[10-(4-amino-2-methyl-1-quinoliniumyl)decyl]-2-methyl-4-quinoliniumamine dichloride 1-[10-(4-amino-2-methyl-1-quinoliniumyl)decyl]-2-methyl-4-quinoliniumamine(Deq) CHEMBL121663 Dequalinium chloride GNF-Pf-5483 | dequalinium
Type:
Small organic molecule
Emp. Form.:
C30H40N4
Mol. Mass.:
456.6643
SMILES:
Cc1cc(=[NH2+])c2ccccc2n1CCCCCCCCCCn1c(C)cc(=[NH2+])c2ccccc12
: