Target
5-hydroxytryptamine receptor 2C
Ligand
BDBM50060418
Substrate
Meas. Tech.
ChEMBL_2755 (CHEMBL617752)
Ki
2.5±n/a nM
Citation
 Bromidge, SMDabbs, SDavies, DTDuckworth, DMForbes, ITHam, PJones, GEKing, FDSaunders, DVStarr, SThewlis, KMWyman, PABlaney, FENaylor, CBBailey, FBlackburn, TPHolland, VKennett, GARiley, GJWood, MD Novel and selective 5-HT2C/2B receptor antagonists as potential anxiolytic agents: synthesis, quantitative structure-activity relationships, and molecular modeling of substituted 1-(3-pyridylcarbamoyl)indolines. J Med Chem 41:1598-612 (1998)  
Target
Name:
5-hydroxytryptamine receptor 2C
Synonyms:
5-HT-1C 5-HT1C 5-HT2C-INI 5-HTR2C 5-hydroxytryptamine receptor 2C (5-HT-2C) 5HT-1C HTR1C Serotonin (5-HT3) receptor Serotonin Receptor 2C
Type:
G Protein-Coupled Receptor (GPCR)
Mol. Mass.:
51836.79
Organism:
Homo sapiens (Human)
Description:
P28335
Residue:
458
  
Inhibitor
Name:
BDBM50060418
Synonyms:
5-Methylsulfanyl-6-trifluoromethyl-2,3-dihydro-indole-1-carboxylic acid pyridin-3-ylamide SB 221284
Type:
Small organic molecule
Emp. Form.:
C16H14F3N3OS
Mol. Mass.:
353.362
SMILES:
CSc1cc2CCN(C(=O)Nc3cccnc3)c2cc1C(F)(F)F
: