Target
Nociceptin receptor
Ligand
BDBM50472743
Substrate
Meas. Tech.
ChEMBL_144659 (CHEMBL858427)
Ki
3162±n/a nM
Citation
 Guerrini, RCaló, GBigoni, RRizzi, AVarani, KToth, GGessi, SHashiba, EHashimoto, YLambert, DGBorea, PATomatis, RSalvadori, SRegoli, D Further studies on nociceptin-related peptides: discovery of a new chemical template with antagonist activity on the nociceptin receptor. J Med Chem 43:2805-13 (2000)  
Target
Name:
Nociceptin receptor
Synonyms:
K3 opiate receptor Kappa-type 3 opioid receptor Nociceptin/Orphanin FQ, NOP receptor ORGC Oprl Orphanin FQ receptor
Type:
Enzyme Catalytic Domain
Mol. Mass.:
40499.09
Organism:
MOUSE
Description:
Nociceptin/Orphanin FQ, NOP receptor 0 MOUSE::P35377
Residue:
367
  
Inhibitor
Name:
BDBM50472743
Synonyms:
CHEMBL428167
Type:
Small organic molecule
Emp. Form.:
C55H88N20O14
Mol. Mass.:
1253.4128
SMILES:
[#6]-[#6@@H](-[#8])-[#6@H](-[#7]-[#6](=O)-[#6@H](-[#6]-c1ccccc1)-[#7]-[#6](=O)-[#6]-[#7]-[#6](=O)-[#6]-[#7]-[#6](=O)-[#6]-[#7]-[#6]-c1ccccc1)-[#6](=O)-[#7]-[#6]-[#6](=O)-[#7]-[#6@@H](-[#6])-[#6](=O)-[#7]-[#6@@H](-[#6]-[#6]-[#6]\[#7]=[#6](\[#7])-[#7])-[#6](=O)-[#7]-[#6@@H](-[#6]-[#6]-[#6]-[#6]-[#7])-[#6](=O)-[#7]-[#6@@H](-[#6]-[#8])-[#6](=O)-[#7]-[#6@@H](-[#6])-[#6](=O)-[#7]-[#6@@H](-[#6]-[#6]-[#6]\[#7]=[#6](\[#7])-[#7])-[#6](-[#7])=O
: