Target
Somatostatin receptor type 4
Ligand
BDBM50192018
Substrate
Meas. Tech.
ChEMBL_200849 (CHEMBL807059)
Kd
1738±n/a nM
Citation
 Gademann, KKimmerlin, THoyer, DSeebach, D Peptide folding induces high and selective affinity of a linear and small beta-peptide to the human somatostatin receptor 4. J Med Chem 44:2460-8 (2001)  
Target
Name:
Somatostatin receptor type 4
Synonyms:
SOMATOSTATIN SST4 SS4-R SSR4_HUMAN SSTR4 | Somatostatin receptor type 4 (SSTR4)
Type:
Enzyme
Mol. Mass.:
42015.38
Organism:
Homo sapiens (Human)
Description:
P31391
Residue:
388
  
Inhibitor
Name:
BDBM50192018
Synonyms:
CHEMBL3350037
Type:
Small organic molecule
Emp. Form.:
C49H66N10O10S2
Mol. Mass.:
1019.239
SMILES:
[H][C@]1(NC(=O)[C@H](CCCCN)NC(=O)[C@@H](Cc2c[nH]c3ccccc23)NC(=O)[C@H](Cc2ccccc2)NC(=O)[C@H](CSSC[C@H](NC1=O)C(=O)N[C@@H](CO)[C@@H](C)O)NC(=O)[C@H](N)Cc1ccccc1)[C@@H](C)O
: