Target
Nociceptin receptor
Ligand
BDBM50473479
Substrate
Meas. Tech.
ChEMBL_137179 (CHEMBL745349)
Ki
1778±n/a nM
Citation
 Guerrini, RCaló, GBigoni, RRizzi, DRizzi, AZucchini, MVarani, KHashiba, ELambert, DGToth, GBorea, PASalvadori, SRegoli, D Structure-activity studies of the Phe(4) residue of nociceptin(1-13)-NH(2): identification of highly potent agonists of the nociceptin/orphanin FQ receptor. J Med Chem 44:3956-64 (2001)  
Target
Name:
Nociceptin receptor
Synonyms:
K3 opiate receptor Kappa-type 3 opioid receptor Nociceptin/Orphanin FQ, NOP receptor ORGC Oprl Orphanin FQ receptor
Type:
Enzyme Catalytic Domain
Mol. Mass.:
40499.09
Organism:
MOUSE
Description:
Nociceptin/Orphanin FQ, NOP receptor 0 MOUSE::P35377
Residue:
367
  
Inhibitor
Name:
BDBM50473479
Synonyms:
CHEMBL262928
Type:
Small organic molecule
Emp. Form.:
C61H101N23O15
Mol. Mass.:
1396.5997
SMILES:
[#6]-[#6@@H](-[#8])-[#6@H](-[#7]-[#6](=O)-[#6@H](-[#6]-c1ccc(-[#7])cc1)-[#7]-[#6](=O)-[#6]-[#7]-[#6](=O)-[#6]-[#7]-[#6](=O)-[#6@@H](-[#7])-[#6]-c1ccccc1)-[#6](=O)-[#7]-[#6]-[#6](=O)-[#7]-[#6@@H](-[#6])-[#6](=O)-[#7]-[#6@@H](-[#6]-[#6]-[#6]\[#7]=[#6](\[#7])-[#7])-[#6](=O)-[#7]-[#6@@H](-[#6]-[#6]-[#6]-[#6]-[#7])-[#6](=O)-[#7]-[#6@@H](-[#6]-[#8])-[#6](=O)-[#7]-[#6@@H](-[#6])-[#6](=O)-[#7]-[#6@@H](-[#6]-[#6]-[#6]\[#7]=[#6](\[#7])-[#7])-[#6](=O)-[#7]-[#6@@H](-[#6]-[#6]-[#6]-[#6]-[#7])-[#6](-[#7])=O
: