Target
Serine/threonine-protein phosphatase 2A 56 kDa regulatory subunit alpha isoform
Ligand
BDBM50473785
Substrate
Meas. Tech.
ChEMBL_162010 (CHEMBL764181)
Kd
1096±n/a nM
Citation
 Ishchenko, AVShakhnovich, EI SMall Molecule Growth 2001 (SMoG2001): an improved knowledge-based scoring function for protein-ligand interactions. J Med Chem 45:2770-80 (2002)  
Target
Name:
Serine/threonine-protein phosphatase 2A 56 kDa regulatory subunit alpha isoform
Synonyms:
2A5A_HUMAN Serine/threonine protein phosphatase 2A, 56 kDa regulatory subunit, alpha isoform | Serine/threonine-protein phosphatase 2A 56 kDa regulatory subunit alpha isoform
Type:
PROTEIN
Mol. Mass.:
56194.06
Organism:
Homo sapiens (Human)
Description:
ChEMBL_161424
Residue:
486
  
Inhibitor
Name:
BDBM50473785
Synonyms:
CHEMBL94507
Type:
Small organic molecule
Emp. Form.:
C10H17N4O19P5
Mol. Mass.:
652.1262
SMILES:
O[C@@H]1[C@@H](COP(O)(=O)OP(O)(=O)OP(O)(=O)OP(O)(=O)OP(O)(O)=O)O[C@H]([C@@H]1O)n1cnc2cncnc12
: