Target
Somatostatin receptor type 2
Ligand
BDBM50474230
Substrate
Meas. Tech.
ChEMBL_200689 (CHEMBL857870)
Ki
0.079433±n/a nM
Citation
 Lewis, IBauer, WAlbert, RChandramouli, NPless, JWeckbecker, GBruns, C A novel somatostatin mimic with broad somatotropin release inhibitory factor receptor binding and superior therapeutic potential. J Med Chem 46:2334-44 (2003)  
Target
Name:
Somatostatin receptor type 2
Synonyms:
SOMATOSTATIN SST2 SS-2-R SS2R SSTR2 | Somatostatin receptor type 2 (SSTR2)
Type:
Enzyme
Mol. Mass.:
41344.94
Organism:
Homo sapiens (Human)
Description:
P30874
Residue:
369
  
Inhibitor
Name:
BDBM50474230
Synonyms:
CHEMBL3349516
Type:
Small organic molecule
Emp. Form.:
C76H105N19O17S2
Mol. Mass.:
1620.894
SMILES:
[H][C@]1(NC(=O)[C@H](Cc2ccccc2)NC(=O)[C@@]([H])(NC(=O)[C@H](CCCCN)NC(=O)[C@H](Cc2c[nH]c3ccccc23)NC(=O)[C@H](Cc2ccccc2)NC(=O)[C@H](Cc2ccccc2)NC(=O)[C@H](CC(N)=O)NC(=O)[C@H](CCCCN)NC(=O)[C@H](CSSC[C@H](NC(=O)[C@H](C)NC1=O)C(N)=O)NC(=O)CNC(=O)[C@H](C)N)[C@@H](C)O)[C@@H](C)O
: