Target
Corticosteroid-binding globulin
Ligand
BDBM50170653
Substrate
Meas. Tech.
ChEMBL_48199 (CHEMBL665995)
Ki
13.2±n/a nM
Citation
 Kotani, THigashiura, K Comparative molecular active site analysis (CoMASA). 1. An approach to rapid evaluation of 3D QSAR. J Med Chem 47:2732-42 (2004)  
Target
Name:
Corticosteroid-binding globulin
Synonyms:
CBG Corticosteroid binding globulin | SERPINA6
Type:
PROTEIN
Mol. Mass.:
45136.82
Organism:
Homo sapiens
Description:
ChEMBL_10503
Residue:
405
  
Inhibitor
Name:
BDBM50170653
Synonyms:
(11beta)-11,21-dihydroxypregn-4-ene-3,20-dione 11beta,21-dihydroxyprogesterone CHEMBL110739 | corticosterone
Type:
Small organic molecule
Emp. Form.:
C21H30O4
Mol. Mass.:
346.4605
SMILES:
C[C@]12C[C@H](O)[C@H]3[C@@H](CCC4=CC(=O)CC[C@]34C)[C@@H]1CC[C@@H]2C(=O)CO
: