Target
GTP:AMP phosphotransferase AK3, mitochondrial
Ligand
BDBM50027422
Substrate
Meas. Tech.
ChEMBL_32202 (CHEMBL648981)
Ki
900000±n/a nM
Citation
 Hampton, APatel, ADMaeda, MHai, TTChang, CDKang, JBKappler, FAbo, MPreston, RK Use of adenine nucleotide derivatives to assess the potential of exo-active-site-directed reagents as species- or isozyme-specific enzyme inactivators. 3. Synthesis of adenosine 5'-triphosphate derivatives with N6- or 8-substituents bearing iodoacetyl groups. J Med Chem 25:373-81 (1982)  
Target
Name:
GTP:AMP phosphotransferase AK3, mitochondrial
Synonyms:
AK 3 Adenylate kinase 3 alpha like 1 Ak3 Akl3l KAD3_RAT
Type:
PROTEIN
Mol. Mass.:
25443.58
Organism:
Rattus norvegicus
Description:
ChEMBL_1340551
Residue:
227
  
Inhibitor
Name:
BDBM50027422
Synonyms:
1N-{4-[9-(3,4-dihydroxy-5-hydroxymethyltetrahydro-2-furanyl)-9H-6-purinyl(methyl)amino]butyl}-1N-methylacetamide 5'-Triphosphate | CHEMBL2367949
Type:
Small organic molecule
Emp. Form.:
C18H31N6O14P3
Mol. Mass.:
648.3918
SMILES:
CN(CCCCN(C)c1ncnc2n(cnc12)[C@@H]1O[C@H](COP(O)(=O)OP(O)(=O)OP(O)(O)=O)[C@@H](O)[C@H]1O)C(C)=O
: