Target
Prostaglandin G/H synthase 2
Ligand
BDBM50474742
Substrate
Meas. Tech.
ChEMBL_157824 (CHEMBL769428)
IC50
23.3±n/a nM
Citation
 Shin, SSByun, YLim, KMChoi, JKLee, KWMoh, JHKim, JKJeong, YSKim, JYChoi, YHKoh, HJPark, YHOh, YINoh, MSChung, S In vitro structure-activity relationship and in vivo studies for a novel class of cyclooxygenase-2 inhibitors: 5-aryl-2,2-dialkyl-4-phenyl-3(2H)furanone derivatives. J Med Chem 47:792-804 (2004)  
Target
Name:
Prostaglandin G/H synthase 2
Synonyms:
Cox-2 Cyclooxygenase-2 Glucocorticoid-regulated inflammatory cyclooxygenase Macrophage activation-associated marker protein P71/73 PGH synthase 2 PGHS-2 Pghs-b Prostaglandin H2 synthase 2 Ptgs2 Tis10
Type:
Protein
Mol. Mass.:
69020.39
Organism:
Mus musculus (Mouse)
Description:
Q05769
Residue:
604
  
Inhibitor
Name:
BDBM50474742
Synonyms:
CHEMBL166295
Type:
Small organic molecule
Emp. Form.:
C18H17NO4S
Mol. Mass.:
343.397
SMILES:
CC1(C)OC(=C(C1=O)c1ccccc1)c1ccc(cc1)S(N)(=O)=O
: