Target
Glutamate receptor ionotropic, NMDA 1/2B
Ligand
BDBM50474799
Substrate
Meas. Tech.
ChEMBL_143457 (CHEMBL752567)
Ki
0.400000±n/a nM
Citation
 McCauley, JATheberge, CRRomano, JJBillings, SBAnderson, KDClaremon, DAFreidinger, RMBednar, RAMosser, SDGaul, SLConnolly, TMCondra, CLXia, MCunningham, MEBednar, BStump, GLLynch, JJMacaulay, AWafford, KAKoblan, KSLiverton, NJ NR2B-selective N-methyl-D-aspartate antagonists: synthesis and evaluation of 5-substituted benzimidazoles. J Med Chem 47:2089-96 (2004)  
Target
Name:
Glutamate receptor ionotropic, NMDA 1/2B
Synonyms:
GluN1/GluN2B NMDA receptor Glutamate [NMDA] receptor subunit epsilon 2/zeta 1 nr2b nam
Type:
Enzyme
Mol. Mass.:
Description:
Components:
This complex has 2 components.
Component 1
Name:
Glutamate receptor ionotropic, NMDA 1
Synonyms:
GRIN1 Glutamate [NMDA] receptor subunit zeta-1 N-methyl-D-aspartate receptor subunit NR1 NMDZ1_HUMAN | phencyclidine
Type:
Enzyme Catalytic Domain
Mol. Mass.:
105397.81
Organism:
Homo sapiens (Human)
Description:
Q05586
Residue:
938
  
Component 2
Name:
Glutamate receptor ionotropic, NMDA 2B
Synonyms:
GRIN2B Glutamate [NMDA] receptor subunit epsilon 2 N-methyl D-aspartate receptor subtype 2B NMDAR2B NR3 | hNR3
Type:
PROTEIN
Mol. Mass.:
166375.46
Organism:
Homo sapiens (Human)
Description:
ChEMBL_1438829
Residue:
1484
  
Inhibitor
Name:
BDBM50474799
Synonyms:
CHEMBL416690
Type:
Small organic molecule
Emp. Form.:
C21H25N3O
Mol. Mass.:
335.4427
SMILES:
Cc1ccc(CC2CCN(Cc3nc4cc(O)ccc4[nH]3)CC2)cc1
: