Target
Estrogen receptor beta
Ligand
BDBM50474892
Substrate
Meas. Tech.
ChEMBL_312915 (CHEMBL826597)
IC50
0.700000±n/a nM
Citation
 Wallace, OBBryant, HUShetler, PKAdrian, MDGeiser, AG Benzothiophene and naphthalene derived constrained SERMs. Bioorg Med Chem Lett 14:5103-6 (2004)  
Target
Name:
Estrogen receptor beta
Synonyms:
Estrogen receptor
Type:
Mol. Mass.:
Description:
ASSAY_ID of ChEMBL is 99778
Components:
This complex has 2 components.
Component 1
Name:
Estrogen receptor beta
Synonyms:
ER-beta ESR2_HUMAN Estradiol receptor beta (ERβ) Estrogen receptor (ER beta) Estrogen receptor beta (ER beta) NR3A2 estrogen beta
Type:
Protein
Mol. Mass.:
59238.43
Organism:
Homo sapiens (Human)
Description:
Q92731
Residue:
530
  
Component 2
Name:
Estrogen receptor
Synonyms:
ER ESR ESR1_HUMAN Estrogen receptor Estrogen receptor (ER-alpha) Estrogen receptor alpha (ER) Nuclear receptor subfamily 3 group A member 1
Type:
Protein
Mol. Mass.:
66230.44
Organism:
Homo sapiens (Human)
Description:
P03372
Residue:
595
  
Inhibitor
Name:
BDBM50474892
Synonyms:
CHEMBL184958
Type:
Small organic molecule
Emp. Form.:
C30H31NO3S
Mol. Mass.:
485.637
SMILES:
OC(CCN1CCCCC1)c1ccc(cc1)C1c2c(Cc3cc(O)ccc13)sc1cc(O)ccc21
: