Target
Alpha-1B adrenergic receptor
Ligand
BDBM50475533
Substrate
Meas. Tech.
ChEMBL_326681 (CHEMBL868697)
Ki
0.251189±n/a nM
Citation
 Quaglia, WSantoni, GPigini, MPiergentili, AGentili, FBuccioni, MMosca, MLucciarini, RAmantini, CNabissi, MIBallarini, PPoggesi, ELeonardi, AGiannella, M Structure-activity relationships in 1,4-benzodioxan-related compounds. 8.(1) {2-[2-(4-chlorobenzyloxy)phenoxy]ethyl}-[2-(2,6-dimethoxyphenoxy)ethyl]amine (clopenphendioxan) as a tool to highlight the involvement of alpha1D- and alpha1B-adrenoreceptor subtypes in the regulation of human PC-3 prostate J Med Chem 48:7750-63 (2005)  
Target
Name:
Alpha-1B adrenergic receptor
Synonyms:
ADA1B_HUMAN Adrenergic alpha1B Adrenergic receptor alpha Alpha 1B-adrenoreceptor | Alpha-1B adrenergic receptor
Type:
Enzyme
Mol. Mass.:
56862.13
Organism:
Homo sapiens (Human)
Description:
P35368
Residue:
520
  
Inhibitor
Name:
BDBM50475533
Synonyms:
CHEMBL199080
Type:
Small organic molecule
Emp. Form.:
C26H31NO5
Mol. Mass.:
437.528
SMILES:
COc1cccc(OC)c1OCCNCCOc1ccccc1OCc1cccc(C)c1
: