Target
Alpha-1D adrenergic receptor
Ligand
BDBM50475532
Substrate
Meas. Tech.
ChEMBL_326682 (CHEMBL868698)
Ki
0.063096±n/a nM
Citation
 Quaglia, WSantoni, GPigini, MPiergentili, AGentili, FBuccioni, MMosca, MLucciarini, RAmantini, CNabissi, MIBallarini, PPoggesi, ELeonardi, AGiannella, M Structure-activity relationships in 1,4-benzodioxan-related compounds. 8.(1) {2-[2-(4-chlorobenzyloxy)phenoxy]ethyl}-[2-(2,6-dimethoxyphenoxy)ethyl]amine (clopenphendioxan) as a tool to highlight the involvement of alpha1D- and alpha1B-adrenoreceptor subtypes in the regulation of human PC-3 prostate J Med Chem 48:7750-63 (2005)  
Target
Name:
Alpha-1D adrenergic receptor
Synonyms:
ADA1D_HUMAN ADRA1D Adrenergic receptor alpha Alpha 1D-adrenoreceptor Alpha-1D adrenoceptor adrenergic Alpha1D
Type:
Enzyme Catalytic Domain
Mol. Mass.:
60485.82
Organism:
Homo sapiens (Human)
Description:
adrenergic Alpha1D ADRA1D HUMAN::P25100
Residue:
572
  
Inhibitor
Name:
BDBM50475532
Synonyms:
CHEMBL197442
Type:
Small organic molecule
Emp. Form.:
C25H28N2O7
Mol. Mass.:
468.499
SMILES:
COc1cccc(OC)c1OCCNCCOc1ccccc1OCc1cccc(c1)[N+]([O-])=O
: