Target
Cannabinoid receptor 1
Ligand
BDBM50180036
Substrate
Meas. Tech.
ChEMBL_327124 (CHEMBL864630)
EC50
1995±n/a nM
Citation
 Salo, OMSavinainen, JRParkkari, TNevalainen, TLahtela-Kakkonen, MGynther, JLaitinen, JTJärvinen, TPoso, A 3D-QSAR studies on cannabinoid CB1 receptor agonists: G-protein activation as biological data. J Med Chem 49:554-66 (2006)  
Target
Name:
Cannabinoid receptor 1
Synonyms:
Brain-type cannabinoid receptor CB-R CNR1_RAT Cannabinoid receptor Cnr1 | Skr6
Type:
G Protein-Coupled Receptor (GPCR)
Mol. Mass.:
52856.55
Organism:
Rattus norvegicus (rat)
Description:
P20272
Residue:
473
  
Inhibitor
Name:
BDBM50180036
Synonyms:
(6aR,10aR)-3-(1,1-dimethylbutyl)-6a,7,10,10a-tetrahydro-6,6,9-trimethyl-6Hdibenzo[b,d]pyran CHEMBL371214 | JWH-133
Type:
Small organic molecule
Emp. Form.:
C22H32O
Mol. Mass.:
312.4889
SMILES:
CCCC(C)(C)c1ccc2[C@@H]3CC(C)=CC[C@H]3C(C)(C)Oc2c1
: