Target
Muscarinic acetylcholine receptor M3
Ligand
BDBM50004656
Substrate
Meas. Tech.
ChEMBL_432435 (CHEMBL917430)
EC50
1820±n/a nM
Citation
 Piergentili, AQuaglia, WGiannella, MDel Bello, FBruni, BBuccioni, MCarrieri, ACiattini, S Dioxane and oxathiane nuclei: suitable substructures for muscarinic agonists. Bioorg Med Chem 15:886-96 (2007)  
Target
Name:
Muscarinic acetylcholine receptor M3
Synonyms:
ACM3_HUMAN Cholinergic, muscarinic M3 Muscarinic receptor M3 | RecName: Full=Muscarinic acetylcholine receptor M3
Type:
Enzyme
Mol. Mass.:
66151.03
Organism:
Homo sapiens (Human)
Description:
P20309
Residue:
590
  
Inhibitor
Name:
BDBM50004656
Synonyms:
(2-Carbamoyloxy-ethyl)-trimethyl-ammonium (2-Hydroxyethyl)trimethyl ammonium chloride carbamate (carbachol)(2-Carbamoyloxy-ethyl)-trimethyl-ammonium 2-((Aminocarbonyl)oxy)-N,N,N-trimethylethanaminum chloride 2-(carbamoyloxy)-N,N,N-trimethylethanaminium chloride CARBASTAT Carbachol chloride Choline carbamate chloride Choline chlorine carbamate Karbamoylcholin chlorid | MIOSTAT
Type:
Small organic molecule
Emp. Form.:
C6H15N2O2
Mol. Mass.:
147.195
SMILES:
C[N+](C)(C)CCOC(N)=O
: