Target
D(3) dopamine receptor
Ligand
BDBM35254
Substrate
Meas. Tech.
ChEMBL_446505 (CHEMBL895619)
Ki
20±n/a nM
Citation
 Lange, JHReinders, JHTolboom, JTGlennon, JCCoolen, HKKruse, CG Principal component analysis differentiates the receptor binding profiles of three antipsychotic drug candidates from current antipsychotic drugs. J Med Chem 50:5103-8 (2007)  
Target
Name:
D(3) dopamine receptor
Synonyms:
DOPAMINE D3 DRD3_HUMAN Dopamine D3 receptor (D3) Dopamine receptor Dopamine receptor D3
Type:
Mol. Mass.:
44243.43
Organism:
Homo sapiens (Human)
Description:
Residue:
400
  
Inhibitor
Name:
BDBM35254
Synonyms:
2-methyl-4-(4-methylpiperazin-1-yl)-10H-thieno[2,3-b][1,5]benzodiazepine Olansek Zyprexa | olanzapine
Type:
Small organic molecule
Emp. Form.:
C17H20N4S
Mol. Mass.:
312.432
SMILES:
CN1CCN(CC1)C1=Nc2ccccc2Nc2sc(C)cc12
: