Target
Presenilin-1
Ligand
BDBM50476875
Substrate
Meas. Tech.
ChEMBL_447417 (CHEMBL896441)
Ki
6.2±n/a nM
Citation
 Yang, MGShi, JLModi, DPWells, JCochran, BMWolf, MAThompson, LARamanjulu, MMRoach, AHZaczek, RRobertson, DWWexler, RROlson, RE Design and synthesis of benzoazepinone-derived cyclic malonamides and aminoamides as potent gamma-secretase inhibitors. Bioorg Med Chem Lett 17:3910-5 (2007)  
Target
Name:
Presenilin-1
Synonyms:
3.4.23.- Gamma-Secretase Subunit Presenilin-1 PS1 PSEN1 PSNL1 Presenilin-1 CTF12 Protein S182
Type:
Mol. Mass.:
52657.13
Organism:
Homo sapiens (Human)
Description:
P49768
Residue:
467
  
Inhibitor
Name:
BDBM50476875
Synonyms:
CHEMBL232183
Type:
Small organic molecule
Emp. Form.:
C27H32N4O3
Mol. Mass.:
460.568
SMILES:
CC(C)CNC(=O)C1(CCCC1)C(=O)N[C@H]1N=C(c2ccccc2)c2ccccc2N(C)C1=O
: