Target
Presenilin-1
Ligand
BDBM50477052
Substrate
Meas. Tech.
ChEMBL_449238 (CHEMBL899500)
IC50
2.0±n/a nM
Citation
 Chen, YLCherry, KCorman, MLEbbinghaus, CFGamlath, CBListon, DMartin, BAOborski, CESahagan, BG Thiazole-diamides as potent gamma-secretase inhibitors. Bioorg Med Chem Lett 17:5518-22 (2007)  
Target
Name:
Presenilin-1
Synonyms:
3.4.23.- Gamma-Secretase Subunit Presenilin-1 PS1 PSEN1 PSNL1 Presenilin-1 CTF12 Protein S182
Type:
Mol. Mass.:
52657.13
Organism:
Homo sapiens (Human)
Description:
P49768
Residue:
467
  
Inhibitor
Name:
BDBM50477052
Synonyms:
CHEMBL240066
Type:
Small organic molecule
Emp. Form.:
C25H36F2N4O2S
Mol. Mass.:
494.641
SMILES:
CCC[C@H](NC(=O)Cc1cc(F)cc(F)c1)C(=O)Nc1nc(C)c(s1)C(C)NCCC(C)(C)C
: