Target
Presenilin-1
Ligand
BDBM50477372
Substrate
Meas. Tech.
ChEMBL_453271 (CHEMBL902426)
IC50
1.1±n/a nM
Citation
 Asberom, TZhao, ZBara, TAClader, JWGreenlee, WJHyde, LAJosien, HBLi, WMcPhail, ATNomeir, AAParker, EMRajagopalan, MSong, LWong, GTZhang, LZhang, QPissarnitski, DA Discovery of gamma-secretase inhibitors efficacious in a transgenic animal model of Alzheimer's disease. Bioorg Med Chem Lett 17:511-6 (2007)  
Target
Name:
Presenilin-1
Synonyms:
3.4.23.- Gamma-Secretase Subunit Presenilin-1 PS1 PSEN1 PSNL1 Presenilin-1 CTF12 Protein S182
Type:
Mol. Mass.:
52657.13
Organism:
Homo sapiens (Human)
Description:
P49768
Residue:
467
  
Inhibitor
Name:
BDBM50477372
Synonyms:
CHEMBL245413
Type:
Small organic molecule
Emp. Form.:
C27H32ClF2N3O4S
Mol. Mass.:
568.075
SMILES:
CCN1CCN(CC1)C(=O)OC1(CC1)C1CCCC(N1S(=O)(=O)c1ccc(Cl)cc1)c1cc(F)cc(F)c1
: