Target
Neuropeptide S receptor
Ligand
BDBM50412707
Substrate
Meas. Tech.
ChEMBL_460809 (CHEMBL943824)
EC50
1.1±n/a nM
Citation
 Camarda, VTrapella, CCalo, GGuerrini, RRizzi, ARuzza, CFiorini, SMarzola, EReinscheid, RKRegoli, DSalvadori, S Synthesis and biological activity of human neuropeptide S analogues modified in position 2. J Med Chem 51:655-8 (2008)  
Target
Name:
Neuropeptide S receptor
Synonyms:
Gpr154 Npsr1 | Pgr14
Type:
PROTEIN
Mol. Mass.:
42447.53
Organism:
Mus musculus
Description:
ChEMBL_445691
Residue:
371
  
Inhibitor
Name:
BDBM50412707
Synonyms:
CHEMBL230333
Type:
Small organic molecule
Emp. Form.:
C93H155N31O28S
Mol. Mass.:
2187.482
SMILES:
CSCC[C@H](NC(=O)CNC(=O)[C@@H](NC(=O)CNC(=O)[C@@H](NC(=O)CNC(=O)[C@H](CC(N)=O)NC(=O)[C@H](CCCNC(N)=N)NC(=O)[C@H](Cc1ccccc1)NC(=O)[C@@H](N)CO)C(C)C)[C@@H](C)O)C(=O)N[C@@H](CCCCN)C(=O)N[C@@H](CCCCN)C(=O)N[C@@H]([C@@H](C)O)C(=O)N[C@@H](CO)C(=O)N[C@@H](Cc1ccccc1)C(=O)N[C@@H](CCC(N)=O)C(=O)N[C@@H](CCCNC(N)=N)C(=O)N[C@@H](C)C(=O)N[C@@H](CCCCN)C(=O)N[C@@H](CO)C(O)=O
: