Target
Luciferin 4-monooxygenase
Ligand
BDBM50238214
Substrate
Meas. Tech.
ChEMBL_476207 (CHEMBL923738)
IC50
500±n/a nM
Citation
 Auld, DSSouthall, NTJadhav, AJohnson, RLDiller, DJSimeonov, AAustin, CPInglese, J Characterization of chemical libraries for luciferase inhibitory activity. J Med Chem 51:2372-86 (2008)  
Target
Name:
Luciferin 4-monooxygenase
Synonyms:
LUCI_PHOPY | Luciferase
Type:
PROTEIN
Mol. Mass.:
60747.46
Organism:
Photinus pyralis
Description:
ChEMBL_938513
Residue:
550
  
Inhibitor
Name:
BDBM50238214
Synonyms:
(2-(4-ethoxyphenyl)quinolin-4-yl)(4-(pyridin-2-yl)piperazin-1-yl)methanone | CHEMBL261118
Type:
Small organic molecule
Emp. Form.:
C27H26N4O2
Mol. Mass.:
438.5209
SMILES:
CCOc1ccc(cc1)-c1cc(C(=O)N2CCN(CC2)c2ccccn2)c2ccccc2n1
: