Target
Thymidylate synthase
Ligand
BDBM50028375
Substrate
Meas. Tech.
ChEBML_217700
Ki
2600±n/a nM
Citation
 Barr, PJNolan, PASanti, DVRobins, MJ Inhibition of thymidylate synthetase by 5-alkynyl-2'-deoxyuridylates. J Med Chem 24:1385-8 (1982)  
Target
Name:
Thymidylate synthase
Synonyms:
TSase Thymidylate Synthase (TS) thyA
Type:
Enzyme
Mol. Mass.:
36576.54
Organism:
Lactobacillus casei
Description:
Residue:
316
  
Inhibitor
Name:
BDBM50028375
Synonyms:
CHEMBL3143872 | Phosphoric acid mono-[5-(5-hex-1-ynyl-2,4-dioxo-3,4-dihydro-2H-pyrimidin-1-yl)-3-hydroxy-tetrahydro-furan-2-ylmethyl] ester
Type:
Small organic molecule
Emp. Form.:
C15H21N2O8P
Mol. Mass.:
388.3096
SMILES:
CCCCC#Cc1cn([C@H]2C[C@H](O)[C@@H](COP(O)(O)=O)O2)c(=O)[nH]c1=O
: