Target
HIV-1 protease
Ligand
BDBM12884
Substrate
Meas. Tech.
ChEMBL_517306 (CHEMBL1031359)
Ki
0.100000±n/a nM
Citation
 Jorissen, RNReddy, GSAli, AAltman, MDChellappan, SAnjum, SGTidor, BSchiffer, CARana, TMGilson, MK Additivity in the analysis and design of HIV protease inhibitors. J Med Chem 52:737-54 (2009)  
Target
Name:
HIV-1 protease
Synonyms:
HIV-1 protease
Type:
PROTEIN
Mol. Mass.:
10795.19
Organism:
Human immunodeficiency virus
Description:
ChEMBL_118439
Residue:
99
  
Inhibitor
Name:
BDBM12884
Synonyms:
(5S)-N-[(1S,2R)-1-Benzyl-2-hydroxy-3-[isobutyl[(4-methoxy-phenyl)sulfonyl]amino]propyl]-2-oxo-3-phenyloxazolidine-5-carboxamide N-Aryl-oxazolidinone-5-carboxamide Analogue 21a
Type:
Small organic molecule
Emp. Form.:
C31H37N3O7S
Mol. Mass.:
595.706
SMILES:
COc1ccc(cc1)S(=O)(=O)N(CC(C)C)C[C@@H](O)[C@H](Cc1ccccc1)NC(=O)[C@@H]1CN(C(=O)O1)c1ccccc1
: