Target
HIV-1 protease
Ligand
BDBM81673
Substrate
Meas. Tech.
ChEMBL_517306 (CHEMBL1031359)
Ki
58±n/a nM
Citation
 Jorissen, RNReddy, GSAli, AAltman, MDChellappan, SAnjum, SGTidor, BSchiffer, CARana, TMGilson, MK Additivity in the analysis and design of HIV protease inhibitors. J Med Chem 52:737-54 (2009)  
Target
Name:
HIV-1 protease
Synonyms:
HIV-1 protease
Type:
PROTEIN
Mol. Mass.:
10795.19
Organism:
Human immunodeficiency virus
Description:
ChEMBL_118439
Residue:
99
  
Inhibitor
Name:
BDBM81673
Synonyms:
CARB-KB45
Type:
Small organic molecule
Emp. Form.:
C23H31N3O6S
Mol. Mass.:
477.574
SMILES:
CNC(=O)CCC(=O)N[C@@H](Cc1ccccc1)[C@H](O)CN(CC1CC1)S(=O)(=O)c1ccco1
: