Target
HIV-1 protease
Ligand
BDBM12889
Substrate
Meas. Tech.
ChEMBL_517306 (CHEMBL1031359)
Ki
0.032000±n/a nM
Citation
 Jorissen, RNReddy, GSAli, AAltman, MDChellappan, SAnjum, SGTidor, BSchiffer, CARana, TMGilson, MK Additivity in the analysis and design of HIV protease inhibitors. J Med Chem 52:737-54 (2009)  
Target
Name:
HIV-1 protease
Synonyms:
HIV-1 protease
Type:
PROTEIN
Mol. Mass.:
10795.19
Organism:
Human immunodeficiency virus
Description:
ChEMBL_118439
Residue:
99
  
Inhibitor
Name:
BDBM12889
Synonyms:
(5S)-3-(3-Acetylphenyl)-N-[(1S,2R)-3-[[(4-aminophenyl)sulfonyl](isobutyl)amino]-1-benzyl-2-hydroxypropyl]-2-oxooxazolidine-5-carboxamide N-Aryl-oxazolidinone-5-carboxamide Analogue 25e
Type:
Small organic molecule
Emp. Form.:
C32H38N4O7S
Mol. Mass.:
622.732
SMILES:
CC(C)CN(C[C@@H](O)[C@H](Cc1ccccc1)NC(=O)[C@@H]1CN(C(=O)O1)c1cccc(c1)C(C)=O)S(=O)(=O)c1ccc(N)cc1
: