Target
Protease
Ligand
BDBM50483075
Substrate
Meas. Tech.
ChEMBL_685646 (CHEMBL1285548)
Ki
0.235000±n/a nM
Citation
 Ali, AReddy, GSNalam, MNAnjum, SGCao, HSchiffer, CARana, TM Structure-based design, synthesis, and structure-activity relationship studies of HIV-1 protease inhibitors incorporating phenyloxazolidinones. J Med Chem 53:7699-708 (2010)  
Target
Name:
Protease
Synonyms:
Type:
Enzyme
Mol. Mass.:
10904.79
Organism:
Human immunodeficiency virus 1 (HIV-1)
Description:
Q9YQ12
Residue:
99
  
Inhibitor
Name:
BDBM50483075
Synonyms:
CHEMBL1276059
Type:
Small organic molecule
Emp. Form.:
C32H36F3N3O7S
Mol. Mass.:
663.704
SMILES:
CC(C)CN(C[C@@H](O)[C@H](Cc1ccccc1)NC(=O)[C@@H]1CN(C(=O)O1)c1ccccc1C(F)(F)F)S(=O)(=O)c1ccc(CO)cc1
: