Target
Protease
Ligand
BDBM50180655
Substrate
Meas. Tech.
ChEMBL_685646 (CHEMBL1285548)
Ki
0.005000±n/a nM
Citation
 Ali, AReddy, GSNalam, MNAnjum, SGCao, HSchiffer, CARana, TM Structure-based design, synthesis, and structure-activity relationship studies of HIV-1 protease inhibitors incorporating phenyloxazolidinones. J Med Chem 53:7699-708 (2010)  
Target
Name:
Protease
Synonyms:
Type:
Enzyme
Mol. Mass.:
10904.79
Organism:
Human immunodeficiency virus 1 (HIV-1)
Description:
Q9YQ12
Residue:
99
  
Inhibitor
Name:
BDBM50180655
Synonyms:
A-157378-0 ABT-378 Kaletra med.21724, Compound 185
Type:
Small organic molecule
Emp. Form.:
C37H48N4O5
Mol. Mass.:
628.8008
SMILES:
CC(C)[C@H](N1CCCNC1=O)C(=O)N[C@H](C[C@H](O)[C@H](Cc1ccccc1)NC(=O)COc1c(C)cccc1C)Cc1ccccc1
: