Target
Metabotropic glutamate receptor 5
Ligand
BDBM50483144
Substrate
Meas. Tech.
ChEMBL_695415 (CHEMBL1639085)
IC50
32±n/a nM
Citation
 Pilla, MAndreoli, MTessari, MDelle-Fratte, SRoth, AButler, SBrown, FShah, PBettini, ECavallini, PBenedetti, RMinick, DSmith, PTehan, BD'Alessandro, PLorthioir, OBall, CGarzya, VGoodacre, CWatson, S The identification of novel orally active mGluR5 antagonist GSK2210875. Bioorg Med Chem Lett 20:7521-4 (2010)  
Target
Name:
Metabotropic glutamate receptor 5
Synonyms:
GRM5_MOUSE Grm5 | Mglur5
Type:
PROTEIN
Mol. Mass.:
131881.16
Organism:
Mus musculus
Description:
ChEMBL_103834
Residue:
1203
  
Inhibitor
Name:
BDBM50483144
Synonyms:
CHEMBL1630057 | GSK2210875
Type:
Small organic molecule
Emp. Form.:
C14H14N4O2S
Mol. Mass.:
302.352
SMILES:
C[C@@H](OC(=O)Nc1ccccc1)c1sc2ncnn2c1C
: