Target
Sialidase
Ligand
BDBM50212400
Substrate
Meas. Tech.
ChEMBL_698049 (CHEMBL1645800)
IC50
1600±n/a nM
Citation
 Dao, TTNguyen, PHLee, HSKim, EPark, JLim, SIOh, WK Chalcones as novel influenza A (H1N1) neuraminidase inhibitors from Glycyrrhiza inflata. Bioorg Med Chem Lett 21:294-8 (2011)  
Target
Name:
Sialidase
Synonyms:
NANH_CLOPF | nanH
Type:
PROTEIN
Mol. Mass.:
42808.79
Organism:
Clostridium perfringens
Description:
ChEMBL_991336
Residue:
382
  
Inhibitor
Name:
BDBM50212400
Synonyms:
1-(2,4-Dihydroxyphenyl)-3-[4-hydroxy-3-(3-methylbut-2-enyl)phenyl]-prop-2-en-1-one CHEMBL229885 | licoagrochalcone A
Type:
Small organic molecule
Emp. Form.:
C20H20O4
Mol. Mass.:
324.3704
SMILES:
[#6]\[#6](-[#6])=[#6]/[#6]-c1cc(\[#6]=[#6]\[#6](=O)-c2ccc(-[#8])cc2-[#8])ccc1-[#8]
: