Target
Protease
Ligand
BDBM50483338
Substrate
Meas. Tech.
ChEMBL_715372 (CHEMBL1664701)
Ki
0.005000±n/a nM
Citation
 Ghosh, AKChapsal, BDBaldridge, ASteffey, MPWalters, DEKoh, YAmano, MMitsuya, H Design and synthesis of potent HIV-1 protease inhibitors incorporating hexahydrofuropyranol-derived high affinity P(2) ligands: structure-activity studies and biological evaluation. J Med Chem 54:622-34 (2011)  
Target
Name:
Protease
Synonyms:
Type:
Enzyme
Mol. Mass.:
10904.79
Organism:
Human immunodeficiency virus 1 (HIV-1)
Description:
Q9YQ12
Residue:
99
  
Inhibitor
Name:
BDBM50483338
Synonyms:
CHEMBL1651155
Type:
Small organic molecule
Emp. Form.:
C30H42N2O7S
Mol. Mass.:
574.729
SMILES:
[H][C@@]12CCC[C@H](OC(=O)N[C@@H](Cc3ccccc3)[C@H](O)CN(CC(C)C)S(=O)(=O)c3ccc(OC)cc3)[C@]1([H])CCO2
: