Target
NAD-dependent protein deacetylase sirtuin-1
Ligand
BDBM50502268
Substrate
Meas. Tech.
ChEMBL_1806346 (CHEMBL4305705)
IC50
71±n/a nM
Citation
 Kawaguchi, MIeda, NNakagawa, H Development of Peptide-Based Sirtuin Defatty-Acylase Inhibitors Identified by the Fluorescence Probe, SFP3, That Can Efficiently Measure Defatty-Acylase Activity of Sirtuin. J Med Chem 62:5434-5452 (2019)  
Target
Name:
NAD-dependent protein deacetylase sirtuin-1
Synonyms:
NAD-Dependent Deacetylase Sirtuin-1 NAD-dependent protein deacetylase sirtuin-1 (SIRT1) SIR2-like protein 1 SIRT1 Sirtuin-1 (SIRT1) | hSIR2
Type:
Developmental protein; hydrolase
Mol. Mass.:
81626.66
Organism:
Homo sapiens (Human)
Description:
Residue:
747
  
Inhibitor
Name:
BDBM50502268
Synonyms:
CHEMBL4447813
Type:
Small organic molecule
Emp. Form.:
C49H71N15O8
Mol. Mass.:
998.1837
SMILES:
CC[C@H](C)[C@H](NC(=O)[C@H](CCCNC(N)=N)NC(C)=O)C(=O)N[C@@H](CCCCNC(=O)Cc1ccc(cc1)\N=N\c1ccccc1)C(=O)N[C@@H](CCCNC(N)=N)C(=O)N[C@@H](Cc1ccc(O)cc1)C(N)=O
: