Target
Reverse transcriptase protein
Ligand
BDBM2483
Substrate
Meas. Tech.
ChEMBL_755188 (CHEMBL1805967)
Ki
8.5±n/a nM
Citation
 Su, DSLim, JJTinney, ETucker, TJSaggar, SSisko, JTWan, BLYoung, MBAnderson, KDRudd, DMunshi, VBahnck, CFelock, PJLu, MLai, MTTouch, SMoyer, GDistefano, DJFlynn, JALiang, YSanchez, RPerlow-Poehnelt, RMiller, MVacca, JPWilliams, TMAnthony, NJ Biaryl ethers as potent allosteric inhibitors of reverse transcriptase and its key mutant viruses: aryl substituted pyrazole as a surrogate for the pyrazolopyridine motif. Bioorg Med Chem Lett 20:4328-32 (2010)  
Target
Name:
Reverse transcriptase protein
Synonyms:
Reverse Transcriptase Reverse Transcriptase (F61A)
Type:
Protein
Mol. Mass.:
30203.56
Organism:
Human immunodeficiency virus 1
Description:
Q9WJQ2
Residue:
259
  
Inhibitor
Name:
BDBM2483
Synonyms:
(4S)-6-chloro-4-(2-cyclopropylethynyl)-4-(trifluoromethyl)-2,4-dihydro-1H-3,1-benzoxazin-2-one DMP-266 Efavirenz L-743,726 | Sustiva
Type:
Small organic molecule
Emp. Form.:
C14H9ClF3NO2
Mol. Mass.:
315.675
SMILES:
FC(F)(F)[C@]1(OC(=O)Nc2ccc(Cl)cc12)C#CC1CC1
: