Target
Reverse transcriptase protein
Ligand
BDBM50484033
Substrate
Meas. Tech.
ChEMBL_755188 (CHEMBL1805967)
Ki
9.6±n/a nM
Citation
 Su, DSLim, JJTinney, ETucker, TJSaggar, SSisko, JTWan, BLYoung, MBAnderson, KDRudd, DMunshi, VBahnck, CFelock, PJLu, MLai, MTTouch, SMoyer, GDistefano, DJFlynn, JALiang, YSanchez, RPerlow-Poehnelt, RMiller, MVacca, JPWilliams, TMAnthony, NJ Biaryl ethers as potent allosteric inhibitors of reverse transcriptase and its key mutant viruses: aryl substituted pyrazole as a surrogate for the pyrazolopyridine motif. Bioorg Med Chem Lett 20:4328-32 (2010)  
Target
Name:
Reverse transcriptase protein
Synonyms:
Reverse Transcriptase Reverse Transcriptase (F61A)
Type:
Protein
Mol. Mass.:
30203.56
Organism:
Human immunodeficiency virus 1
Description:
Q9WJQ2
Residue:
259
  
Inhibitor
Name:
BDBM50484033
Synonyms:
CHEMBL1801229
Type:
Small organic molecule
Emp. Form.:
C22H14Cl2N4O2
Mol. Mass.:
437.278
SMILES:
Clc1cc(Oc2cc(OCc3cc([nH]n3)-c3ccccn3)ccc2Cl)cc(c1)C#N
: