Target
Tubulin beta chain
Ligand
BDBM50030765
Substrate
Meas. Tech.
ChEMBL_815990 (CHEMBL2026544)
Kd
1060±n/a nM
Citation
 Yamazaki, YTanaka, KNicholson, BDeyanat-Yazdi, GPotts, BYoshida, TOda, AKitagawa, TOrikasa, SKiso, YYasui, HAkamatsu, MChinen, TUsui, TShinozaki, YYakushiji, FMiller, BRNeuteboom, SPalladino, MKanoh, KLloyd, GKHayashi, Y Synthesis and structure-activity relationship study of antimicrotubule agents phenylahistin derivatives with a didehydropiperazine-2,5-dione structure. J Med Chem 55:1056-71 (2012)  
Target
Name:
Tubulin beta chain
Synonyms:
Beta-tubulin Tubulin beta chain
Type:
PROTEIN
Mol. Mass.:
49840.26
Organism:
Sus scrofa
Description:
ChEMBL_105107
Residue:
445
  
Inhibitor
Name:
BDBM50030765
Synonyms:
NPI-2358 | Plinabulin
Type:
Small organic molecule
Emp. Form.:
C19H20N4O2
Mol. Mass.:
336.3877
SMILES:
CC(C)(C)c1[nH]cnc1\C=c1/[nH]c(=O)\c(=C\c2ccccc2)[nH]c1=O
: