Target
ATP-binding cassette sub-family C member 2
Ligand
BDBM50485593
Substrate
Meas. Tech.
ChEMBL_838314 (CHEMBL2076812)
Ki
46±n/a nM
Citation
 Horikawa, MKato, YTyson, CASugiyama, Y The potential for an interaction between MRP2 (ABCC2) and various therapeutic agents: probenecid as a candidate inhibitor of the biliary excretion of irinotecan metabolites. Drug Metab Pharmacokinet 17:23-33 (2002)  
Target
Name:
ATP-binding cassette sub-family C member 2
Synonyms:
ATP-binding cassette sub-family C member 2 Canalicular multidrug resistance protein Cmoat MRP2_RAT Multidrug resistance-associated protein 2
Type:
PROTEIN
Mol. Mass.:
173415.22
Organism:
Rattus norvegicus
Description:
ChEMBL_1455464
Residue:
1541
  
Inhibitor
Name:
BDBM50485593
Synonyms:
CHEMBL2074809
Type:
Small organic molecule
Emp. Form.:
C30H26Br3N3O16S3
Mol. Mass.:
1020.445
SMILES:
N[C@@H](CCC(=O)N[C@@H](CSc1c(Br)c2C(=O)OC(c2c(Br)c1Br)(c1ccc(O)c(c1)S(O)(=O)=O)c1ccc(O)c(c1)S(O)(=O)=O)C(=O)NCC(O)=O)C(O)=O
: