Target
Bile salt export pump
Ligand
BDBM50391000
Substrate
Meas. Tech.
ChEMBL_838078 (CHEMBL2075452)
Ki
31000±n/a nM
Citation
 Byrne, JAStrautnieks, SSMieli-Vergani, GHiggins, CFLinton, KJThompson, RJ The human bile salt export pump: characterization of substrate specificity and identification of inhibitors. Gastroenterology 123:1649-58 (2002)  
Target
Name:
Bile salt export pump
Synonyms:
ABCB11 ATP-binding cassette sub-family B member 11 Bile Salt Export Pump, BSEP Bile salt export pump (BSEP)
Type:
Protein
Mol. Mass.:
146405.49
Organism:
Homo sapiens (Human)
Description:
O95342
Residue:
1321
  
Inhibitor
Name:
BDBM50391000
Synonyms:
CB-01-11 | RIFAMYCIN
Type:
Small organic molecule
Emp. Form.:
C37H47NO12
Mol. Mass.:
697.7686
SMILES:
CO[C@H]1\C=C\O[C@@]2(C)Oc3c(C2=O)c2c(O)cc(NC(=O)\C(C)=C/C=C/[C@H](C)[C@H](O)[C@@H](C)[C@@H](O)[C@@H](C)[C@H](OC(C)=O)[C@@H]1C)c(O)c2c(O)c3C
: