Target
Solute carrier family 22 member 6
Ligand
BDBM50240008
Substrate
Meas. Tech.
ChEMBL_835960 (CHEMBL2077098)
Ki
6020±n/a nM
Citation
 Jung, KYTakeda, MKim, DKTojo, ANarikawa, SYoo, BSHosoyamada, MCha, SHSekine, TEndou, H Characterization of ochratoxin A transport by human organic anion transporters. Life Sci 69:2123-35 (2001)  
Target
Name:
Solute carrier family 22 member 6
Synonyms:
OAT1 PAH transporter Renal organic anion transporter 1 SLC22A6 hPAHT | hROAT1
Type:
PROTEIN
Mol. Mass.:
61831.78
Organism:
Homo sapiens (Human)
Description:
ChEMBL_1487359
Residue:
563
  
Inhibitor
Name:
BDBM50240008
Synonyms:
Aminohippuric Acid PAHA | Para-Aminohippuric Acid
Type:
Small organic molecule
Emp. Form.:
C9H10N2O3
Mol. Mass.:
194.1873
SMILES:
Nc1ccc(cc1)C(=O)NCC(O)=O
: