Target
Solute carrier family 15 member 2
Ligand
BDBM50188516
Substrate
Meas. Tech.
ChEMBL_836690 (CHEMBL2077645)
Ki
64000±n/a nM
Citation
 Ganapathy, MEBrandsch, MPrasad, PDGanapathy, VLeibach, FH Differential recognition of beta -lactam antibiotics by intestinal and renal peptide transporters, PEPT 1 and PEPT 2. J Biol Chem 270:25672-7 (1995)  
Target
Name:
Solute carrier family 15 member 2
Synonyms:
Kidney H(+)/peptide cotransporter PEPT2 S15A2_HUMAN | SLC15A2
Type:
PROTEIN
Mol. Mass.:
81795.62
Organism:
Homo sapiens (Human)
Description:
ChEMBL_762551
Residue:
729
  
Inhibitor
Name:
BDBM50188516
Synonyms:
2-(2-amino-N-methylacetamido)acetic acid Gly-Sar [(2-Amino-acetyl)-methyl-amino]-acetic acid | [(ammonioacetyl)(methyl)amino]acetate
Type:
Small organic molecule
Emp. Form.:
C5H10N2O3
Mol. Mass.:
146.1445
SMILES:
CN(CC(O)=O)C(=O)CN
: