Target
ATP-dependent translocase ABCB1
Ligand
BDBM50486029
Substrate
Meas. Tech.
ChEMBL_882171 (CHEMBL2215003)
Ki
280±n/a nM
Citation
 Chan, KFWong, ILKan, JWYan, CSChow, LMChan, TH Amine linked flavonoid dimers as modulators for P-glycoprotein-based multidrug resistance: structure-activity relationship and mechanism of modulation. J Med Chem 55:1999-2014 (2012)  
Target
Name:
ATP-dependent translocase ABCB1
Synonyms:
ABCB1 MDR1_HUMAN Multidrug resistance protein 1 P-glycoprotein (P-gp) PGY1
Type:
Protein
Mol. Mass.:
141503.50
Organism:
Homo sapiens (Human)
Description:
P08183
Residue:
1280
  
Inhibitor
Name:
BDBM50486029
Synonyms:
CHEMBL2172398
Type:
Small organic molecule
Emp. Form.:
C45H41NO8
Mol. Mass.:
723.8089
SMILES:
O=c1cc(oc2ccccc12)-c1ccc(OCCOCCN(CCOCCOc2ccc(cc2)-c2cc(=O)c3ccccc3o2)Cc2ccccc2)cc1
: