Target
Genome polyprotein
Ligand
BDBM50486111
Substrate
Meas. Tech.
ChEMBL_885186 (CHEMBL2213720)
Ki
0.700000±n/a nM
Citation
 Rudd, MTMcIntyre, CJRomano, JJButcher, JWHolloway, MKBush, KNguyen, KTGilbert, KFLyle, TALiverton, NJWan, BLSumma, VHarper, SRowley, MVacca, JPCarroll, SSBurlein, CDiMuzio, JMGates, AGraham, DJHuang, QLudmerer, SWMcClain, SMcHale, CStahlhut, MFandozzi, CTaylor, ATrainor, NOlsen, DBMcCauley, JA Development of macrocyclic inhibitors of HCV NS3/4A protease with cyclic constrained P2-P4 linkers. Bioorg Med Chem Lett 22:7207-13 (2012)  
Target
Name:
Genome polyprotein
Synonyms:
Genome polyprotein
Type:
PROTEIN
Mol. Mass.:
74061.95
Organism:
Hepacivirus C
Description:
ChEMBL_118425
Residue:
694
  
Inhibitor
Name:
BDBM50486111
Synonyms:
CHEMBL2203888
Type:
Small organic molecule
Emp. Form.:
C45H60N6O10S
Mol. Mass.:
877.057
SMILES:
[H][C@@]12C[C@H](N(C1)C(=O)[C@@H](NC(=O)N1CCC(CC1)OCCC\C=C\c1cc3c(O2)cc(OCC)nc3cc1OC)C1CCCCC1)C(=O)N[C@@]1(C[C@H]1C=C)C(=O)NS(=O)(=O)C1CC1
: