Target
Plasminogen
Ligand
BDBM50029503
Substrate
Meas. Tech.
ChEMBL_155063 (CHEMBL764381)
IC50
740000±n/a nM
Citation
 Shuman, RTRothenberger, RBCampbell, CSSmith, GFGifford-Moore, DSPaschal, JWGesellchen, PD Structure-activity study of tripeptide thrombin inhibitors using alpha-alkyl amino acids and other conformationally constrained amino acid substitutions. J Med Chem 38:4446-53 (1995)  
Target
Name:
Plasminogen
Synonyms:
Activation peptide PLG Plasmin Plasmin heavy chain A, short form | Plasmin light chain B
Type:
Enzyme
Mol. Mass.:
90579.18
Organism:
Homo sapiens (Human)
Description:
Residue:
810
  
Inhibitor
Name:
BDBM50029503
Synonyms:
(S)-1-((S)-1,2,3,4-Tetrahydro-isoquinoline-3-carbonyl)-pyrrolidine-2-carboxylic acid ((S)-1-formyl-4-guanidino-1-methyl-butyl)-amide | CHEMBL343518
Type:
Small organic molecule
Emp. Form.:
C22H32N6O3
Mol. Mass.:
428.5279
SMILES:
C[C@@](CCCNC(N)=N)(NC(=O)[C@@H]1CCCN1C(=O)[C@@H]1Cc2ccccc2CN1)C=O
: