Target
Serine protease 1
Ligand
BDBM50029515
Substrate
Meas. Tech.
ChEMBL_212346 (CHEMBL816793)
IC50
9.7±n/a nM
Citation
 Shuman, RTRothenberger, RBCampbell, CSSmith, GFGifford-Moore, DSPaschal, JWGesellchen, PD Structure-activity study of tripeptide thrombin inhibitors using alpha-alkyl amino acids and other conformationally constrained amino acid substitutions. J Med Chem 38:4446-53 (1995)  
Target
Name:
Serine protease 1
Synonyms:
Beta-Trypsin PRSS1 TRY1 TRYP1 Trypsin I
Type:
Enzyme
Mol. Mass.:
25790.52
Organism:
Bos taurus (bovine)
Description:
P00760
Residue:
246
  
Inhibitor
Name:
BDBM50029515
Synonyms:
CHEMBL141584 | tert-butyloxy carbonyl-D-Phe-azetidine-2-carboxylate-Arg-H
Type:
Small organic molecule
Emp. Form.:
C24H36N6O6
Mol. Mass.:
504.5792
SMILES:
CC(C)(C)OC(=O)N[C@@H](Cc1ccccc1)C(=O)N1CC[C@H]1C(=O)N[C@@H](CCCNC(N)=N)C(O)=O
: