Target
Serine protease 1
Ligand
BDBM50029500
Substrate
Meas. Tech.
ChEMBL_212346 (CHEMBL816793)
IC50
23±n/a nM
Citation
 Shuman, RTRothenberger, RBCampbell, CSSmith, GFGifford-Moore, DSPaschal, JWGesellchen, PD Structure-activity study of tripeptide thrombin inhibitors using alpha-alkyl amino acids and other conformationally constrained amino acid substitutions. J Med Chem 38:4446-53 (1995)  
Target
Name:
Serine protease 1
Synonyms:
Beta-Trypsin PRSS1 TRY1 TRYP1 Trypsin I
Type:
Enzyme
Mol. Mass.:
25790.52
Organism:
Bos taurus (bovine)
Description:
P00760
Residue:
246
  
Inhibitor
Name:
BDBM50029500
Synonyms:
(S)-1-((S)-1,2,3,4-Tetrahydro-isoquinoline-3-carbonyl)-pyrrolidine-2-carboxylic acid ((S)-1-formyl-4-guanidino-butyl)-amide | CHEMBL102552
Type:
Small organic molecule
Emp. Form.:
C21H30N6O3
Mol. Mass.:
414.5013
SMILES:
NC(=N)NCCC[C@H](NC(=O)[C@@H]1CCCN1C(=O)[C@@H]1Cc2ccccc2CN1)C=O
: