Target
Dihydrofolate reductase
Ligand
BDBM50029763
Substrate
Meas. Tech.
ChEMBL_52983 (CHEMBL884358)
IC50
3000±n/a nM
Citation
 Queener, SF New drug developments for opportunistic infections in immunosuppressed patients: Pneumocystis carinii. J Med Chem 38:4739-59 (1996)  
Target
Name:
Dihydrofolate reductase
Synonyms:
DYR_PNECA Dihydrofolate reductase Tetrahydrofolate dehydrogenase
Type:
Enzyme
Mol. Mass.:
23891.29
Organism:
Pneumocystis carinii
Description:
Residue:
206
  
Inhibitor
Name:
BDBM50029763
Synonyms:
5-(3,5-Diethoxy-4-pyrrol-1-yl-benzyl)-pyrimidine-2,4-diamine Epiroprim | TCMDC-137295
Type:
Small organic molecule
Emp. Form.:
C19H23N5O2
Mol. Mass.:
353.4182
SMILES:
CCOc1cc(Cc2cnc(N)nc2N)cc(OCC)c1-n1cccc1
: