Target
Peroxisome proliferator-activated receptor gamma
Ligand
BDBM50122344
Substrate
Meas. Tech.
ChEMBL_899662 (CHEMBL3052673)
EC50
2188±n/a nM
Citation
  TBA Med Chem Res 21:2873-2884 (2012)    Article 
Target
Name:
Peroxisome proliferator-activated receptor gamma
Synonyms:
NR1C3 PPAR-gamma PPARG_HUMAN Peroxisome proliferator-activated receptor gamma (PPAR gamma) Peroxisome proliferator-activated receptor gamma (PPARĪ³) peroxisome proliferator-activated receptor gamma isoform 2
Type:
Nuclear Receptor
Mol. Mass.:
57613.46
Organism:
Homo sapiens (Human)
Description:
P37231
Residue:
505
  
Inhibitor
Name:
BDBM50122344
Synonyms:
(S)-3-{4-[3,3-Bis-(4-methoxy-phenyl)-allyloxy]-phenyl}-2-ethoxy-propionic acid | CHEMBL328099
Type:
Small organic molecule
Emp. Form.:
C28H30O6
Mol. Mass.:
462.5342
SMILES:
[#6]-[#6]-[#8]-[#6@@H](-[#6]-c1ccc(-[#8]-[#6]\[#6]=[#6](/c2ccc(-[#8]-[#6])cc2)-c2ccc(-[#8]-[#6])cc2)cc1)-[#6](-[#8])=O
: