Target
Type-1 angiotensin II receptor
Ligand
BDBM50029902
Substrate
Meas. Tech.
ChEMBL_35272 (CHEMBL648577)
Ki
>4±n/a nM
Citation
 Salimbeni, ACanevotti, RPaleari, FPoma, DCaliari, SFici, FCirillo, RRenzetti, ARSubissi, ABelvisi, L N-3-substituted pyrimidinones as potent, orally active, AT1 selective angiotensin II receptor antagonists. J Med Chem 38:4806-20 (1996)  
Target
Name:
Type-1 angiotensin II receptor
Synonyms:
AGTR1 Angiotensin II type 1a (AT-1a) receptor
Type:
PROTEIN
Mol. Mass.:
41107.81
Organism:
Bos taurus
Description:
ChEMBL_36779
Residue:
359
  
Inhibitor
Name:
BDBM50029902
Synonyms:
6-Butyl-2-methyl-5-[2'-(1H-tetrazol-5-yl)-biphenyl-4-ylmethyl]-3H-pyrimidin-4-one | CHEMBL144016
Type:
Small organic molecule
Emp. Form.:
C23H24N6O
Mol. Mass.:
400.4763
SMILES:
CCCCc1nc(C)[nH]c(=O)c1Cc1ccc(cc1)-c1ccccc1-c1nnn[nH]1
: