Target
Integrin alpha-5/beta-1
Ligand
BDBM50030039
Substrate
Meas. Tech.
ChEMBL_217623 (CHEMBL820366)
IC50
6800±n/a nM
Citation
 Cheng, SCraig, WSMullen, DTschopp, JFDixon, DPierschbacher, MD Design and synthesis of novel cyclic RGD-containing peptides as highly potent and selective integrin alpha IIb beta 3 antagonists. J Med Chem 37:1-8 (1994)  
Target
Name:
Integrin alpha-5/beta-1
Synonyms:
Fibronectin receptor alpha/beta ITGA5/ITGB1
Type:
Enzyme
Mol. Mass.:
Description:
Components:
This complex has 2 components.
Component 1
Name:
Integrin alpha-5
Synonyms:
CD49 antigen-like family member E FNRA Fibronectin receptor subunit alpha ITGA5 Integrin alpha-F | VLA-5
Type:
Single-pass type I membrane protein
Mol. Mass.:
114523.00
Organism:
Homo sapiens (Human)
Description:
Residue:
1049
  
Component 2
Name:
Integrin beta-1
Synonyms:
CD_antigen=CD29 Fibronectin receptor beta GPIIA ITGB1 MDF2 | MSK12
Type:
Enzyme
Mol. Mass.:
88400.38
Organism:
Homo sapiens (Human)
Description:
P05556
Residue:
798
  
Inhibitor
Name:
BDBM50030039
Synonyms:
Ac-(D-Pen)-N-P-R-G-D-(Y-OMe)-R-C-NH2 | CHEMBL2371547
Type:
Small organic molecule
Emp. Form.:
C47H73N17O14S2
Mol. Mass.:
1164.318
SMILES:
[H][C@]12[#6]-[#6]-[#6]-[#7]1-[#6](=O)-[#6@H](-[#6]-[#6](-[#7])=O)-[#7]-[#6](=O)-[#6@@H](-[#7]-[#6](-[#6])=O)C([#6])([#6])[#16]-[#16]-[#6]-[#6@H](-[#7]-[#6](=O)-[#6@H](-[#6]-[#6]-[#6]\[#7]=[#6](\[#7])-[#7])-[#7]-[#6](=O)-[#6@@H](-[#6]-c1ccc(-[#8]-[#6])cc1)-[#7]-[#6](=O)-[#6@H](-[#6]-[#6](-[#8])=O)-[#7]-[#6](=O)-[#6]-[#7]-[#6](=O)-[#6@H](-[#6]-[#6]-[#6]\[#7]=[#6](\[#7])-[#7])-[#7]-[#6]2=O)-[#6](-[#7])=O
: