Target
Epoxide hydrolase 1
Ligand
BDBM25725
Substrate
Meas. Tech.
ChEMBL_903347 (CHEMBL3051825)
IC50
1200±n/a nM
Citation
  TBA Med Chem Res 21:4214-4218 (2012)    Article 
Target
Name:
Epoxide hydrolase 1
Synonyms:
EPHX EPOX Epoxide hydrolase (HsEH) HYEP_HUMAN | Microsomal epoxide hydrolase
Type:
Protein
Mol. Mass.:
52954.28
Organism:
Homo sapiens (Human)
Description:
P07099
Residue:
455
  
Inhibitor
Name:
BDBM25725
Synonyms:
1,3-diphenylurea | Urea-based compound, 7
Type:
Small organic molecule
Emp. Form.:
C13H12N2O
Mol. Mass.:
212.2472
SMILES:
O=C(Nc1ccccc1)Nc1ccccc1
: