Target
Reverse transcriptase/RNaseH
Ligand
BDBM1663
Substrate
Meas. Tech.
ChEMBL_195068 (CHEMBL797523)
IC50
760±n/a nM
Citation
 Proudfoot, JRPatel, URKapadia, SRHargrave, KD Novel non-nucleoside inhibitors of HIV-1 reverse transcriptase. 3. Dipyrido[2,3-b:2',3'-e]diazepinones. J Med Chem 38:1406-10 (1995)  
Target
Name:
Reverse transcriptase/RNaseH
Synonyms:
HIV-1 Reverse Transcriptase RNase H Reverse transcriptase/RNaseH
Type:
PROTEIN
Mol. Mass.:
65229.15
Organism:
Human immunodeficiency virus 1
Description:
ChEMBL_1473730
Residue:
566
  
Inhibitor
Name:
BDBM1663
Synonyms:
2-ethyl-6,9-dimethyl-2,4,9,15-tetraazatricyclo[9.4.0.0^{3,8}]pentadeca-1(11),3(8),4,6,12,14-hexaen-10-one Dipyridodiazepinone deriv. 90
Type:
Small organic molecule
Emp. Form.:
C15H16N4O
Mol. Mass.:
268.3137
SMILES:
CCN1c2ncc(C)cc2N(C)C(=O)c2cccnc12
: